Target
Casein kinase I isoform delta
Ligand
BDBM191583
Substrate
Meas. Tech.
KinaseGlo Plus Luminescent Assay
pH
7.5±n/a
IC50
3.57e+4± 5.2e+3 nM
Comments
extracted
Citation
 Ursu, AIllich, DJTakemoto, YPorfetye, ATZhang, MBrockmeyer, AJanning, PWatanabe, NOsada, HVetter, IRZiegler, SSchöler, HRWaldmann, H Epiblastin A Induces Reprogramming of Epiblast Stem Cells Into Embryonic Stem Cells by Inhibition of Casein Kinase 1. Cell Chem Biol 23:494-507 (2016)  
Target
Name:
Casein kinase I isoform delta
Synonyms:
CKI-delta CSNK1D Casein kinase I delta Casein kinase I isoform delta (CK1D) KC1D_HUMAN | casein kinases 1 delta (CK1 delta)
Type:
Enzyme
Mol. Mass.:
47356.76
Organism:
Homo sapiens (Human)
Description:
P48730
Residue:
415
  
Inhibitor
Name:
BDBM191583
Synonyms:
6-(2,6-difluorophenyl)pteridine-2,4,7-triamine (27)
Type:
Small organic molecule
Emp. Form.:
C12H9F2N7
Mol. Mass.:
289.2436
SMILES:
Nc1nc(N)c2nc(c(N)nc2n1)-c1c(F)cccc1F
: