Target
Transient receptor potential cation channel subfamily V member 4
Ligand
BDBM191742
Substrate
Meas. Tech.
Radiometric Calcium Assay
Temperature
303.15±n/a K
IC50
1350±n/a nM
Comments
extracted
Citation
 Khairatkar-Joshi, NKulkarni, AMukhopadhyay, IKattige, VGBhosale, VMWale, DPThomas, AKumar, SChaudhari, SS Treatment of respiratory disorders using TRPA1 antagonists US Patent  US9186360 Publication Date 11/17/2015 
Target
Name:
Transient receptor potential cation channel subfamily V member 4
Synonyms:
TRPV4 Transient receptor potential cation channel subfamily V member 4 (TRPV4) VROAC
Type:
Enzyme
Mol. Mass.:
98290.10
Organism:
Homo sapiens (Human)
Description:
Q9HBA0
Residue:
871
  
Inhibitor
Name:
BDBM191742
Synonyms:
US9186360, 102
Type:
Small organic molecule
Emp. Form.:
C20H13ClF4N4O5S
Mol. Mass.:
532.853
SMILES:
Cn1c2oc(Cl)c(CC(=O)Nc3nc(cs3)-c3ccc(OC(F)(F)F)c(F)c3)c2c(=O)n(C)c1=O
: