Target
Cytochrome b
Ligand
BDBM192052
Substrate
Meas. Tech.
Cytochrome b Enzyme Assay
pH
7.4±n/a
Temperature
298.15±n/a K
IC50
2.275e+4±n/a nM
Comments
extracted
Citation
 Vincent, BMLanglois, JBSrinivas, RLancaster, AKScherz-Shouval, RWhitesell, LTidor, BBuchwald, SLLindquist, S A Fungal-Selective Cytochrome bc1 Inhibitor Impairs Virulence and Prevents the Evolution of Drug Resistance. Cell Chem Biol 23:978-991 (2016)  
Target
Name:
Cytochrome b
Synonyms:
Type:
Protein
Mol. Mass.:
43717.83
Organism:
Candida albicans (Yeast)
Description:
Residue:
387
  
Inhibitor
Name:
BDBM192052
Synonyms:
Inz-43
Type:
Small organic molecule
Emp. Form.:
C24H22N2O2
Mol. Mass.:
370.4437
SMILES:
CCC(=O)Cn1nc(-c2cccc(OCc3ccccc3)c2)c2ccccc12
: