Target
Mitogen-activated protein kinase 1 [8-360]
Ligand
BDBM192325
Substrate
Meas. Tech.
Enzymatic Assay
pH
7.3±n/a
IC50
2.3±n/a nM
Comments
extracted
Citation
 Blake, JFChen, HChicarelli, MJDemeese, JGarrey, RFGaudino, JGazzard, LKaus, RJKintz, SMohr, PJMoreno, DASchwarz, JSiedem, CSWallace, EM Substituted quinazolines as serine/threonine kinase inhibitors US Patent  US9187462 Publication Date 11/17/2015 
Target
Name:
Mitogen-activated protein kinase 1 [8-360]
Synonyms:
ERK2 MAPK1 Mitogen Activated Kinase 1 Mitogen-activated protein kinase 1 (aa 8-360) PRKM2
Type:
Mol. Mass.:
40835.09
Organism:
Homo sapiens (Human)
Description:
P28482 aa 8-360
Residue:
353
  
Inhibitor
Name:
BDBM192325
Synonyms:
US9187462, I-5
Type:
Small organic molecule
Emp. Form.:
C24H25F4N5O
Mol. Mass.:
475.4818
SMILES:
CC(C)Nc1ncc2ccc(cc2n1)C(=O)N[C@H]([C@H]1CCCN1)c1ccc(c(F)c1)C(F)(F)F
: