Target
Mitogen-activated protein kinase 1 [8-360]
Ligand
BDBM192354
Substrate
Meas. Tech.
Enzymatic Assay
pH
7.3±n/a
IC50
3.6±n/a nM
Comments
extracted
Citation
 Blake, JFChen, HChicarelli, MJDemeese, JGarrey, RFGaudino, JGazzard, LKaus, RJKintz, SMohr, PJMoreno, DASchwarz, JSiedem, CSWallace, EM Substituted quinazolines as serine/threonine kinase inhibitors US Patent  US9187462 Publication Date 11/17/2015 
Target
Name:
Mitogen-activated protein kinase 1 [8-360]
Synonyms:
ERK2 MAPK1 Mitogen Activated Kinase 1 Mitogen-activated protein kinase 1 (aa 8-360) PRKM2
Type:
Mol. Mass.:
40835.09
Organism:
Homo sapiens (Human)
Description:
P28482 aa 8-360
Residue:
353
  
Inhibitor
Name:
BDBM192354
Synonyms:
US9187462, I-34
Type:
Small organic molecule
Emp. Form.:
C23H20ClFN6O3
Mol. Mass.:
482.895
SMILES:
Fc1cc(ccc1Cl)C(NC(=O)c1ccc2cnc(NC3CCOCC3)nc2c1)c1ncno1
: