Target
Glycogen synthase kinase-3 beta
Ligand
BDBM193703
Substrate
Meas. Tech.
GSK-3β activity assay
IC50
302±0.0 nM
Citation
 Khan, ITantray, MAHamid, HAlam, MSKalam, AHussain, FDhulap, A Synthesis of pyrimidin-4-one-1,2,3-triazole conjugates as glycogen synthase kinase-3ß inhibitors with anti-depressant activity. Bioorg Chem 68:41-55 (2016)  
Target
Name:
Glycogen synthase kinase-3 beta
Synonyms:
GSK-3 beta GSK3B Glycogen synthase kinase 3 beta (GSK3B) Glycogen synthase kinase-3 beta (GSK-3B) Glycogen synthase kinase-3 beta (GSK3B) Glycogen synthase kinase-3beta (GSK3B) | Serine/threonine-protein kinase GSK3B
Type:
Enzyme
Mol. Mass.:
46756.38
Organism:
Homo sapiens (Human)
Description:
P49841
Residue:
420
  
Inhibitor
Name:
BDBM193703
Synonyms:
Pyrimidin-4-one-1,2,3-triazole conjugate, 3d
Type:
Small organic molecule
Emp. Form.:
C21H19N5OS
Mol. Mass.:
389.473
SMILES:
Cc1ccccc1-n1cc(CSc2nc(cc(=O)n2C)-c2ccccc2)nn1
: