Target
Glycogen synthase kinase-3 beta
Ligand
BDBM193711
Substrate
Meas. Tech.
GSK-3β activity assay
IC50
1742±0.0 nM
Citation
 Khan, ITantray, MAHamid, HAlam, MSKalam, AHussain, FDhulap, A Synthesis of pyrimidin-4-one-1,2,3-triazole conjugates as glycogen synthase kinase-3ß inhibitors with anti-depressant activity. Bioorg Chem 68:41-55 (2016)  
Target
Name:
Glycogen synthase kinase-3 beta
Synonyms:
GSK-3 beta GSK3B Glycogen synthase kinase 3 beta (GSK3B) Glycogen synthase kinase-3 beta (GSK-3B) Glycogen synthase kinase-3 beta (GSK3B) Glycogen synthase kinase-3beta (GSK3B) | Serine/threonine-protein kinase GSK3B
Type:
Enzyme
Mol. Mass.:
46756.38
Organism:
Homo sapiens (Human)
Description:
P49841
Residue:
420
  
Inhibitor
Name:
BDBM193711
Synonyms:
Pyrimidin-4-one-1,2,3-triazole conjugate, 3l
Type:
Small organic molecule
Emp. Form.:
C19H16N6OS
Mol. Mass.:
376.435
SMILES:
Cn1c(SCc2cn(nn2)-c2cccnc2)nc(cc1=O)-c1ccccc1
: