Target
Cholinesterase
Ligand
BDBM10625
Substrate
Meas. Tech.
AChE and BuChE Inhibition Assay
pH
8±n/a
IC50
134±1.94 nM
Comments
extracted
Citation
 Yao, DWang, JWang, GJiang, YShang, LZhao, YHuang, JYang, SWang, JYu, Y Design, synthesis and biological evaluation of coumarin derivatives as novel acetylcholinesterase inhibitors that attenuate H2O2-induced apoptosis in SH-SY5Y cells. Bioorg Chem 68:112-123 (2016)  
Target
Name:
Cholinesterase
Synonyms:
Acylcholine acylhydrolase Butyrylcholine esterase (BChE) Butyrylcholinesterase (BuChE) CHLE_HUMAN Cholinesterases Pseudocholinesterase
Type:
Homotetramer
Mol. Mass.:
68422.27
Organism:
Homo sapiens (Human)
Description:
P06276
Residue:
602
  
Inhibitor
Name:
BDBM10625
Synonyms:
({[bis(propan-2-ylamino)phosphoryl]oxy}(propan-2-ylamino)phosphoryl)(propan-2-yl)amine iso-OMPA | tetra(monoisopropyl)pyrophosphortetramide
Type:
Small organic molecule
Emp. Form.:
C12H32N4O3P2
Mol. Mass.:
342.355
SMILES:
CC(C)NP(=O)(NC(C)C)OP(=O)(NC(C)C)NC(C)C
: