Target
Aldo-keto reductase family 1 member A1
Ligand
BDBM193848
Substrate
Meas. Tech.
ALR1 in vitro Inhibition Assay
pH
6.2±n/a
IC50
2.94e+3± 1.23e+3 nM
Comments
extracted
Citation
 Ibrar, ATehseen, YKhan, IHameed, ASaeed, AFurtmann, NBajorath, JIqbal, J Coumarin-thiazole and -oxadiazole derivatives: Synthesis, bioactivity and docking studies for aldose/aldehyde reductase inhibitors. Bioorg Chem 68:177-186 (2016)  
Target
Name:
Aldo-keto reductase family 1 member A1
Synonyms:
AK1A1_BOVIN Aldehyde reductase (ALR1)
Type:
Protein
Mol. Mass.:
36620.67
Organism:
Bos taurus (Cattle)
Description:
Residue:
325
  
Inhibitor
Name:
BDBM193848
Synonyms:
Coumarin-thiazole series I, 6a
Type:
Small organic molecule
Emp. Form.:
C20H15N3O2S
Mol. Mass.:
361.417
SMILES:
C\C(=N/Nc1nc(cs1)-c1cc2ccccc2oc1=O)c1ccccc1
: