Target
Aldo-keto reductase family 1 member B1 [K65Q]
Ligand
BDBM193848
Substrate
Meas. Tech.
ALR2 in vitro Inhibition Assay
IC50
1.2e+2± 5e+1 nM
Citation
 Ibrar, ATehseen, YKhan, IHameed, ASaeed, AFurtmann, NBajorath, JIqbal, J Coumarin-thiazole and -oxadiazole derivatives: Synthesis, bioactivity and docking studies for aldose/aldehyde reductase inhibitors. Bioorg Chem 68:177-186 (2016)  
Target
Name:
Aldo-keto reductase family 1 member B1 [K65Q]
Synonyms:
AKR1B1 Aldose reductase
Type:
Protein
Mol. Mass.:
35916.27
Organism:
Bos taurus (Cattle)
Description:
P16116[K65Q]
Residue:
315
  
Inhibitor
Name:
BDBM193848
Synonyms:
Coumarin-thiazole series I, 6a
Type:
Small organic molecule
Emp. Form.:
C20H15N3O2S
Mol. Mass.:
361.417
SMILES:
C\C(=N/Nc1nc(cs1)-c1cc2ccccc2oc1=O)c1ccccc1
: