Target
Fibroblast growth factor receptor 1
Ligand
BDBM194900
Substrate
Meas. Tech.
High ATP Kinase Assay
pH
7±n/a
Temperature
295.15±n/a K
IC50
1.9±n/a nM
Comments
extracted
Citation
 Brohm, DHeroult, MCollin, MHübsch, WLobell, MLustig, KGrünewald, SBömer, U Disubstituted benzothienyl-pyrrolotriazines and uses thereof US Patent  US9206184 Publication Date 12/8/2015 
Target
Name:
Fibroblast growth factor receptor 1
Synonyms:
BFGFR Basic fibroblast growth factor receptor 1 (FGFR1) CEK FGFR-1 FGFR-1, (FL) FGFR1_HUMAN FLT2 Fibroblast growth factor receptor 1 (FGFR-1) Fms-like tyrosine kinase 2 N-sam bFGF-R | c-fgr
Type:
Receptor
Mol. Mass.:
91861.70
Organism:
Homo sapiens (Human)
Description:
P11362
Residue:
822
  
Inhibitor
Name:
BDBM194900
Synonyms:
US9206184, 81 | US9206184, 82
Type:
Small organic molecule
Emp. Form.:
C21H24ClN5O2S
Mol. Mass.:
445.966
SMILES:
COc1cc(C)cc2cc(sc12)-c1c(CNCC(C)(C)O)c(Cl)n2ncnc(N)c12
: