Target
Fibroblast growth factor receptor 3
Ligand
BDBM194883
Substrate
Meas. Tech.
Kinase Assay
pH
7±n/a
Temperature
295.15±n/a K
IC50
2.9±n/a nM
Comments
extracted
Citation
 Brohm, DHeroult, MCollin, MHübsch, WLobell, MLustig, KGrünewald, SBömer, U Disubstituted benzothienyl-pyrrolotriazines and uses thereof US Patent  US9206184 Publication Date 12/8/2015 
Target
Name:
Fibroblast growth factor receptor 3
Synonyms:
CD_antigen: CD333 FGFR3 Fibroblast growth factor receptor JTK4
Type:
Protein
Mol. Mass.:
87699.57
Organism:
Homo sapiens (Human)
Description:
P22607
Residue:
806
  
Inhibitor
Name:
BDBM194883
Synonyms:
US9206184, 64
Type:
Small organic molecule
Emp. Form.:
C24H29N7O2S
Mol. Mass.:
479.598
SMILES:
COc1cc(C)cc2cc(sc12)-c1c(CNC(C)=O)c(CN2CCNCC2)n2ncnc(N)c12
: