Target
Fibroblast growth factor receptor 3
Ligand
BDBM194891
Substrate
Meas. Tech.
Kinase Assay
pH
7±n/a
Temperature
295.15±n/a K
IC50
0.7±n/a nM
Comments
extracted
Citation
 Brohm, DHeroult, MCollin, MHübsch, WLobell, MLustig, KGrünewald, SBömer, U Disubstituted benzothienyl-pyrrolotriazines and uses thereof US Patent  US9206184 Publication Date 12/8/2015 
Target
Name:
Fibroblast growth factor receptor 3
Synonyms:
CD_antigen: CD333 FGFR3 Fibroblast growth factor receptor JTK4
Type:
Protein
Mol. Mass.:
87699.57
Organism:
Homo sapiens (Human)
Description:
P22607
Residue:
806
  
Inhibitor
Name:
BDBM194891
Synonyms:
US9206184, 72
Type:
Small organic molecule
Emp. Form.:
C22H24N6O3S
Mol. Mass.:
452.529
SMILES:
COc1cc(C)cc2cc(sc12)-c1c(CNC(C)=O)c(CNC(C)=O)n2ncnc(N)c12
: