Target
Fibroblast growth factor receptor 3
Ligand
BDBM194921
Substrate
Meas. Tech.
Kinase Assay
pH
7±n/a
Temperature
295.15±n/a K
IC50
39.8±n/a nM
Comments
extracted
Citation
 Brohm, DHeroult, MCollin, MHübsch, WLobell, MLustig, KGrünewald, SBömer, U Disubstituted benzothienyl-pyrrolotriazines and uses thereof US Patent  US9206184 Publication Date 12/8/2015 
Target
Name:
Fibroblast growth factor receptor 3
Synonyms:
CD_antigen: CD333 FGFR3 Fibroblast growth factor receptor JTK4
Type:
Protein
Mol. Mass.:
87699.57
Organism:
Homo sapiens (Human)
Description:
P22607
Residue:
806
  
Inhibitor
Name:
BDBM194921
Synonyms:
US9206184, 102
Type:
Small organic molecule
Emp. Form.:
C23H25F2N5O2S
Mol. Mass.:
473.539
SMILES:
CCOCc1c(CN2CC(F)(F)C2)n2ncnc(N)c2c1-c1cc2cc(C)cc(OC)c2s1
: