Target
Fibroblast growth factor receptor 3
Ligand
BDBM194940
Substrate
Meas. Tech.
Kinase Assay
pH
7±n/a
Temperature
295.15±n/a K
IC50
24.6±n/a nM
Comments
extracted
Citation
 Brohm, DHeroult, MCollin, MHübsch, WLobell, MLustig, KGrünewald, SBömer, U Disubstituted benzothienyl-pyrrolotriazines and uses thereof US Patent  US9206184 Publication Date 12/8/2015 
Target
Name:
Fibroblast growth factor receptor 3
Synonyms:
CD_antigen: CD333 FGFR3 Fibroblast growth factor receptor JTK4
Type:
Protein
Mol. Mass.:
87699.57
Organism:
Homo sapiens (Human)
Description:
P22607
Residue:
806
  
Inhibitor
Name:
BDBM194940
Synonyms:
US9206184, 121
Type:
Small organic molecule
Emp. Form.:
C25H29N5O4S
Mol. Mass.:
495.594
SMILES:
CCOCc1c(-c2cc3cc(C)cc(OC)c3s2)c2c(N)ncnn2c1C(=O)N1CCC(O)CC1
: