Target
ATP-sensitive inward rectifier potassium channel 1
Ligand
BDBM195032
Substrate
Meas. Tech.
Thallium Flux Assay
Temperature
310.15±n/a K
IC50
70±n/a nM
Comments
extracted
Citation
 Ding, FDong, SFrie, JGu, XJiang, JPasternak, ATang, HWu, ZYu, YSuzuki, T Inhibitors of the renal outer medullary potassium channel US Patent  US9206198 Publication Date 12/8/2015 
Target
Name:
ATP-sensitive inward rectifier potassium channel 1
Synonyms:
ATP-regulated potassium channel ROM-K ATP-sensitive inward rectifier potassium channel 1 KCNJ1 Potassium channel (ATP modulatory) ROMK1 The Renal Outer Medullary Potassium (ROMK)
Type:
Enzyme Catalytic Domain
Mol. Mass.:
44809.08
Organism:
Homo sapiens (Human)
Description:
gi_223460826
Residue:
391
  
Inhibitor
Name:
BDBM195032
Synonyms:
US9206198, 53D
Type:
Small organic molecule
Emp. Form.:
C25H30N2O6
Mol. Mass.:
454.5155
SMILES:
C[C@@H]([C@@H](O)c1ccc2C(=O)OCc2c1C)N1CCC2(CCN(C2=O)C2=C(C)C(=O)OC2)CC1
: