Target
P2X purinoceptor 3
Ligand
BDBM196325
Substrate
Meas. Tech.
Inhibition Assay
pH
7.5±n/a
IC50
0.8±n/a nM
Comments
extracted
Citation
 Kai, HEndoh, TJikihara, SHoriguchi, T Heterocyclic derivative and pharmaceutical composition comprising the same US Patent  US9212130 Publication Date 12/15/2015 
Target
Name:
P2X purinoceptor 3
Synonyms:
ATP receptor P2RX3 P2X purinoceptor 3 P2X purinoceptor 3 (P2X3) P2X3 purinoceptor p2x3 + hsa
Type:
Protein
Mol. Mass.:
44292.02
Organism:
Homo sapiens (Human)
Description:
P56373
Residue:
397
  
Inhibitor
Name:
BDBM196325
Synonyms:
US9212130, I-245
Type:
Small organic molecule
Emp. Form.:
C28H25ClFN5O4
Mol. Mass.:
549.981
SMILES:
Fc1cncc(Oc2ccc(Nc3ncc(NC(=O)C4CCOCC4)c(=O)n3Cc3ccc(Cl)cc3)cc2)c1
: