Target
Isoform 1 of Metabotropic glutamate receptor 5 (5a)
Ligand
BDBM196693
Substrate
Meas. Tech.
Calcium Mobilization Assay
Temperature
310.15±n/a K
EC50
414±n/a nM
Comments
extracted
Citation
 Jaeschke, GJolidon, SLindemann, LStadler, HVieira, E Ethynyl compounds US Patent  US9212171 Publication Date 12/15/2015 
Target
Name:
Isoform 1 of Metabotropic glutamate receptor 5 (5a)
Synonyms:
GPRC1E GRM5_HUMAN Metabotropic glutamate receptor 5 Metabotropic glutamate receptor 5 (mGlu5a) Metabotropic glutamate receptor 5a (mGluR5) Metabotropic glutamate receptor subtype 5 (mGluR5)
Type:
Enzyme
Mol. Mass.:
128885.13
Organism:
Homo sapiens (Human)
Description:
P41594-2
Residue:
1180
  
Inhibitor
Name:
BDBM196693
Synonyms:
US9212171, 18
Type:
Small organic molecule
Emp. Form.:
C20H20N2O2
Mol. Mass.:
320.385
SMILES:
CN1C(=O)C(O)(CC1(C)C)c1ccc(cn1)C#Cc1ccccc1
: