Target
Isoform 1 of Metabotropic glutamate receptor 5 (5a)
Ligand
BDBM196694
Substrate
Meas. Tech.
Calcium Mobilization Assay
Temperature
310.15±n/a K
EC50
96±n/a nM
Comments
extracted
Citation
 Jaeschke, GJolidon, SLindemann, LStadler, HVieira, E Ethynyl compounds US Patent  US9212171 Publication Date 12/15/2015 
Target
Name:
Isoform 1 of Metabotropic glutamate receptor 5 (5a)
Synonyms:
GPRC1E GRM5_HUMAN Metabotropic glutamate receptor 5 Metabotropic glutamate receptor 5 (mGlu5a) Metabotropic glutamate receptor 5a (mGluR5) Metabotropic glutamate receptor subtype 5 (mGluR5)
Type:
Enzyme
Mol. Mass.:
128885.13
Organism:
Homo sapiens (Human)
Description:
P41594-2
Residue:
1180
  
Inhibitor
Name:
BDBM196694
Synonyms:
US9212171, 19
Type:
Small organic molecule
Emp. Form.:
C21H22N2O2
Mol. Mass.:
334.4116
SMILES:
COC1(CC(C)(C)N(C)C1=O)c1ccc(cn1)C#Cc1ccccc1
: