Target
Isoform 1 of Metabotropic glutamate receptor 5 (5a)
Ligand
BDBM196700
Substrate
Meas. Tech.
Calcium Mobilization Assay
Temperature
310.15±n/a K
EC50
35±n/a nM
Comments
extracted
Citation
 Jaeschke, GJolidon, SLindemann, LStadler, HVieira, E Ethynyl compounds US Patent  US9212171 Publication Date 12/15/2015 
Target
Name:
Isoform 1 of Metabotropic glutamate receptor 5 (5a)
Synonyms:
GPRC1E GRM5_HUMAN Metabotropic glutamate receptor 5 Metabotropic glutamate receptor 5 (mGlu5a) Metabotropic glutamate receptor 5a (mGluR5) Metabotropic glutamate receptor subtype 5 (mGluR5)
Type:
Enzyme
Mol. Mass.:
128885.13
Organism:
Homo sapiens (Human)
Description:
P41594-2
Residue:
1180
  
Inhibitor
Name:
BDBM196700
Synonyms:
US9212171, 25
Type:
Small organic molecule
Emp. Form.:
C20H20N2O
Mol. Mass.:
304.3856
SMILES:
CN1CCCC[C@@H](c2ccc(cn2)C#Cc2ccccc2)C1=O
: