Target
Metabotropic glutamate receptor 4
Ligand
BDBM196932
Substrate
Meas. Tech.
Pharmacological Assay
EC50
330±140 nM
Citation
 Acher, FPin, JGoudet, CEschalier, ABusserolles, JRigault, DLemasson, ICesarini, SCommare, B Hypophosphorous acid derivatives having antihyperalgic activity and biological applications thereof US Patent  US9212196 Publication Date 12/15/2015 
Target
Name:
Metabotropic glutamate receptor 4
Synonyms:
GRM4_RAT Grm4 Metabotropic glutamate receptor 4 (mGlu4) mGlu4 metabotropic glutamate 4a
Type:
Enzyme
Mol. Mass.:
101849.79
Organism:
Rattus norvegicus (Rat)
Description:
P31423
Residue:
912
  
Inhibitor
Name:
BDBM196932
Synonyms:
US9212196, Derivative 28
Type:
Small organic molecule
Emp. Form.:
C13H16F2NO8P
Mol. Mass.:
383.2386
SMILES:
N[C@H](CCP(O)(=O)C(O)c1cc(F)c(OCC(O)=O)c(F)c1)C(O)=O
: