Target
Metabotropic glutamate receptor 6
Ligand
BDBM196932
Substrate
Meas. Tech.
Pharmacological Assay
EC50
2500±600 nM
Citation
 Acher, FPin, JGoudet, CEschalier, ABusserolles, JRigault, DLemasson, ICesarini, SCommare, B Hypophosphorous acid derivatives having antihyperalgic activity and biological applications thereof US Patent  US9212196 Publication Date 12/15/2015 
Target
Name:
Metabotropic glutamate receptor 6
Synonyms:
GRM6_RAT Grm6 Metabotropic glutamate receptor 6 (mGlu6) mGlu6 | metabotropic glutamate 6
Type:
Enzyme
Mol. Mass.:
95095.82
Organism:
Rattus norvegicus (Rat)
Description:
P35349
Residue:
871
  
Inhibitor
Name:
BDBM196932
Synonyms:
US9212196, Derivative 28
Type:
Small organic molecule
Emp. Form.:
C13H16F2NO8P
Mol. Mass.:
383.2386
SMILES:
N[C@H](CCP(O)(=O)C(O)c1cc(F)c(OCC(O)=O)c(F)c1)C(O)=O
: