Target
P2X purinoceptor 7
Ligand
BDBM199024
Substrate
Meas. Tech.
In Vitro Assay
IC50
72±n/a nM
Citation
 Hilpert, KHubler, FKimmerlin, TRenneberg, DStamm, SMurphy, M Heterocyclic amide derivatives as P2X7 receptor antagonists US Patent  US9221832 Publication Date 12/29/2015 
Target
Name:
P2X purinoceptor 7
Synonyms:
ATP receptor P2RX7_HUMAN P2X purinoceptor 7 (P2X7) P2Z receptor | Purinergic receptor
Type:
Protein
Mol. Mass.:
68602.85
Organism:
Homo sapiens (Human)
Description:
Q99572
Residue:
595
  
Inhibitor
Name:
BDBM199024
Synonyms:
US9221832, 88
Type:
Small organic molecule
Emp. Form.:
C16H12ClF3N2O2
Mol. Mass.:
356.727
SMILES:
FC(F)(F)c1ccc(CC(=O)NC2COc3ncccc23)c(Cl)c1
: