Target
D(1A) dopamine receptor
Ligand
BDBM86180
Substrate
Meas. Tech.
Competitive Binding Assays
Ki
1.69±0.12 nM
Citation
 Li, WZhang, LXu, LYuan, CDu, PChen, JZhen, XFu, W Functional reversal of (-)-Stepholidine analogues by replacement of benzazepine substructure using the ring-expansion strategy. Chem Biol Drug Des 88:599-607 (2016)  
Target
Name:
D(1A) dopamine receptor
Synonyms:
DA D1 receptor DRD1 Dopamine D1 receptor Dopamine D1A
Type:
Enzyme
Mol. Mass.:
49303.43
Organism:
Homo sapiens (Human)
Description:
P21728
Residue:
446
  
Inhibitor
Name:
BDBM86180
Synonyms:
CAS_87075-17-0 SCH 23390 US9359372, SCH23390
Type:
Small organic molecule
Emp. Form.:
C17H18ClNO
Mol. Mass.:
287.784
SMILES:
CN1CCc2cc(Cl)c(O)cc2C(C1)c1ccccc1
: