Target
Kappa-type opioid receptor
Ligand
BDBM199355
Substrate
Meas. Tech.
Functional Assay
pH
7.4±n/a
Temperature
298.15±n/a K
EC50
86.50±7.43 nM
Comments
extracted
Citation
 Kyle, DJTafesse, L Buprenorphine analogs US Patent  US9221831 Publication Date 12/29/2015 
Target
Name:
Kappa-type opioid receptor
Synonyms:
K-OR-1 Kappa-opioid receptor (KOR) Kappa-type opioid receptor (KOR) OPIATE Kappa OPRK1 kappa opioid receptor (KOR)
Type:
G Protein-Coupled Receptor (GPCR)
Mol. Mass.:
42648.76
Organism:
Homo sapiens (Human)
Description:
P41145
Residue:
380
  
Inhibitor
Name:
BDBM199355
Synonyms:
US9221831, 20
Type:
Small organic molecule
Emp. Form.:
C29H32N2O3
Mol. Mass.:
456.576
SMILES:
CO[C@]12CC[C@@]3(C[C@@H]1COCc1ccccc1)[C@H]1Cc4ccc(C#N)c5O[C@@H]2[C@]3(CCN1C)c45
: