Target
Mitogen-activated protein kinase 1
Ligand
BDBM199726
Substrate
Meas. Tech.
IMAP-FP Assay
IC50
2±n/a nM
Citation
Target
Name:
Mitogen-activated protein kinase 1
Synonyms:
ERK2 Extracellular signal-regulated kinase 2 Extracellular signal-regulated kinase 2 (ERK2) MAPK 2 MK01_HUMAN Mitogen-activated protein kinase 1 (ERK-2) Mitogen-activated protein kinase 2 PRKM2 | p42-MAPK
Type:
Ser/Thr Protein Kinase
Mol. Mass.:
41392.76
Organism:
Homo sapiens (Human)
Description:
P28482
Residue:
360
  
Inhibitor
Name:
BDBM199726
Synonyms:
US9226922, 362
Type:
Small organic molecule
Emp. Form.:
C18H20ClN5O4
Mol. Mass.:
405.835
SMILES:
COc1n[nH]c2cc(NC(=O)N[C@H](C)c3ccc(Cl)c(OC)c3)nc(CO)c12
: