Target
6-phosphofructo-2-kinase/fructose-2,6-bisphosphatase 4
Ligand
BDBM200925
Substrate
Meas. Tech.
Kinase Assay (Method B)
IC50
660±n/a nM
Citation
 Bystrom, SHedgecock, CHoman, ELundback, TMartinsson, JSari, MFarnegardh, KJonsson, M Sulfonamide compounds US Patent  US9233946 Publication Date 1/12/2016 
Target
Name:
6-phosphofructo-2-kinase/fructose-2,6-bisphosphatase 4
Synonyms:
6-phosphofructo-2-kinase/fructose-2,6-bisphosphatase 4 (PFKFB4) PFKFB4
Type:
Enzyme
Mol. Mass.:
54039.68
Organism:
Homo sapiens (Human)
Description:
Q16877
Residue:
469
  
Inhibitor
Name:
BDBM200925
Synonyms:
US9233946, 24
Type:
Small organic molecule
Emp. Form.:
C18H15N5O3S2
Mol. Mass.:
413.473
SMILES:
COc1ccccc1-c1ccc(s1)S(=O)(=O)Nc1cccc(c1)-c1nnn[nH]1
: