Target
Vascular endothelial growth factor receptor 3
Ligand
BDBM202400
Substrate
Meas. Tech.
VEGFR3 Phospho ELISA Assay
pH
7.2±n/a
Temperature
310.15±n/a K
IC50
38±n/a nM
Comments
extracted
Citation
 Foitzik, RCMorrow, BJHemley, CFLunniss, GECamerino, MAGaname, DStupple, PALessene, RKersten, WJHarvey, AJHolmes, IP VEGFR3 inhibitors US Patent  US9238644 Publication Date 1/19/2016 
Target
Name:
Vascular endothelial growth factor receptor 3
Synonyms:
FLT-4 Fms-like tyrosine kinase 4 VEGFR-3 VGFR3_HUMAN Vascular endothelial growth factor receptor 3 (VEGFR-3) | Vascular endothelial growth factor receptor 3 (VEGFR3)
Type:
Protein
Mol. Mass.:
152749.58
Organism:
Homo sapiens (Human)
Description:
P35916-2
Residue:
1363
  
Inhibitor
Name:
BDBM202400
Synonyms:
US9238644, 7
Type:
Small organic molecule
Emp. Form.:
C27H30ClN5O
Mol. Mass.:
476.013
SMILES:
NC(=O)C1(CC1)c1ccccc1CCc1nc(Nc2ccc(cc2)C2CCNCC2)ncc1Cl
: