Target
Orexin receptor type 2
Ligand
BDBM203016
Substrate
Meas. Tech.
In Vitro Assay: Intracellular Calcium Measurements
Temperature
310.15±n/a K
IC50
28±n/a nM
Comments
extracted
Citation
 Aissaoui, HBoss, CBrotschi, CHeidmann, BSifferlen, TWilliams, JT Lactam derivatives useful as orexin receptor antagonists US Patent  US9242970 Publication Date 1/26/2016 
Target
Name:
Orexin receptor type 2
Synonyms:
HCRTR2 OX2R_HUMAN Orexin receptor type 2 (OR-2) Orexin receptor type 2 (OX2R) Ox-2-R | Ox2-R
Type:
Protein
Mol. Mass.:
50710.53
Organism:
Homo sapiens (Human)
Description:
O43614
Residue:
444
  
Inhibitor
Name:
BDBM203016
Synonyms:
US9242970, 167
Type:
Small organic molecule
Emp. Form.:
C21H21ClF3NO4
Mol. Mass.:
443.844
SMILES:
COc1cc(Cl)cc(OC)c1C1CCCC(=O)N1Cc1ccc(OC(F)(F)F)cc1
: