Target
Prostaglandin E2 receptor EP2 subtype
Ligand
BDBM204962
Substrate
Meas. Tech.
Cellular Functional Assay
EC50
2±n/a nM
Citation
 Feutrill, JLeriche, CMiddlemiss, D Aniline derivatives, their preparation and their therapeutic application US Patent  US9249085 Publication Date 2/2/2016 
Target
Name:
Prostaglandin E2 receptor EP2 subtype
Synonyms:
PE2R2_HUMAN PTGER2 Prostaglandin E2 receptor Prostanoid EP2 Receptor
Type:
Enzyme
Mol. Mass.:
39775.71
Organism:
Homo sapiens (Human)
Description:
P43116
Residue:
358
  
Inhibitor
Name:
BDBM204962
Synonyms:
US9249085, I(v)
Type:
Small organic molecule
Emp. Form.:
C23H20F3NO3
Mol. Mass.:
415.405
SMILES:
Cc1cc(cc(CNc2c(F)ccc(OCC(O)=O)c2F)c1C)-c1cccc(F)c1
: