Target
Prostaglandin E2 receptor EP2 subtype
Ligand
BDBM204982
Substrate
Meas. Tech.
Cellular Functional Assay
EC50
3±n/a nM
Citation
 Feutrill, JLeriche, CMiddlemiss, D Aniline derivatives, their preparation and their therapeutic application US Patent  US9249085 Publication Date 2/2/2016 
Target
Name:
Prostaglandin E2 receptor EP2 subtype
Synonyms:
PE2R2_HUMAN PTGER2 Prostaglandin E2 receptor Prostanoid EP2 Receptor
Type:
Enzyme
Mol. Mass.:
39775.71
Organism:
Homo sapiens (Human)
Description:
P43116
Residue:
358
  
Inhibitor
Name:
BDBM204982
Synonyms:
US9249085, I(ap)
Type:
Small organic molecule
Emp. Form.:
C24H24FNO4
Mol. Mass.:
409.4501
SMILES:
COc1cc(CNc2c(C)ccc(OCC(O)=O)c2C)cc(c1)-c1cccc(F)c1
: