Target
Prostaglandin E2 receptor EP4 subtype
Ligand
BDBM204967
Substrate
Meas. Tech.
Receptor Binding Assay
pH
6±n/a
IC50
>300±n/a nM
Comments
extracted
Citation
 Feutrill, JLeriche, CMiddlemiss, D Aniline derivatives, their preparation and their therapeutic application US Patent  US9249085 Publication Date 2/2/2016 
Target
Name:
Prostaglandin E2 receptor EP4 subtype
Synonyms:
PE2R4_HUMAN PGE2 receptor EP4 subtype PTGER4 Prostanoid EP4 receptor
Type:
Enzyme
Mol. Mass.:
53134.53
Organism:
Homo sapiens (Human)
Description:
P35408
Residue:
488
  
Inhibitor
Name:
BDBM204967
Synonyms:
US9249085, I(aa) | US9624159, Compound I(aa)
Type:
Small organic molecule
Emp. Form.:
C22H17F4NO3
Mol. Mass.:
419.3689
SMILES:
Cc1c(F)cc(cc1CNc1c(F)ccc(OCC(O)=O)c1F)-c1cccc(F)c1
: