Target
Prostaglandin E2 receptor EP4 subtype
Ligand
BDBM204977
Substrate
Meas. Tech.
Receptor Binding Assay
pH
6±n/a
IC50
>300±n/a nM
Comments
extracted
Citation
 Feutrill, JLeriche, CMiddlemiss, D Aniline derivatives, their preparation and their therapeutic application US Patent  US9249085 Publication Date 2/2/2016 
Target
Name:
Prostaglandin E2 receptor EP4 subtype
Synonyms:
PE2R4_HUMAN PGE2 receptor EP4 subtype PTGER4 Prostanoid EP4 receptor
Type:
Enzyme
Mol. Mass.:
53134.53
Organism:
Homo sapiens (Human)
Description:
P35408
Residue:
488
  
Inhibitor
Name:
BDBM204977
Synonyms:
US9249085, I(ak) | US9624159, Compound I(ak)
Type:
Small organic molecule
Emp. Form.:
C25H26FNO3
Mol. Mass.:
407.4772
SMILES:
Cc1cc(cc(CNc2c(C)ccc(OCC(O)=O)c2C)c1C)-c1cccc(F)c1
: