Target
Serine/threonine-protein kinase TBK1
Ligand
BDBM205195
Substrate
Meas. Tech.
TBK1 Enzyme Assay
pH
7.5±n/a
Temperature
303.15±n/a K
IC50
46±n/a nM
Comments
extracted
Citation
 Karra, SRStaehle, WStaub, EWucherer-Plietker, M Thiazole derivatives US Patent  US9249114 Publication Date 2/2/2016 
Target
Name:
Serine/threonine-protein kinase TBK1
Synonyms:
NAK Protein cereblon/Serine/threonine-protein kinase TBK1 TANK-binding kinase 1 (TBK-1) TBK1 | TBK1_HUMAN
Type:
protein
Mol. Mass.:
83645.20
Organism:
Homo sapiens (Human)
Description:
Q9UHD2
Residue:
729
  
Inhibitor
Name:
BDBM205195
Synonyms:
US9249114, A21
Type:
Small organic molecule
Emp. Form.:
C23H26N6O3S
Mol. Mass.:
466.556
SMILES:
COc1cnccc1-c1nc(C(N)=O)c(NC(=O)c2ccc(CN3CCN(C)CC3)cc2)s1
: