Target
Serine/threonine-protein kinase TBK1
Ligand
BDBM205202
Substrate
Meas. Tech.
TBK1 Enzyme Assay
pH
7.5±n/a
Temperature
303.15±n/a K
IC50
160±n/a nM
Comments
extracted
Citation
 Karra, SRStaehle, WStaub, EWucherer-Plietker, M Thiazole derivatives US Patent  US9249114 Publication Date 2/2/2016 
Target
Name:
Serine/threonine-protein kinase TBK1
Synonyms:
NAK Protein cereblon/Serine/threonine-protein kinase TBK1 TANK-binding kinase 1 (TBK-1) TBK1 | TBK1_HUMAN
Type:
protein
Mol. Mass.:
83645.20
Organism:
Homo sapiens (Human)
Description:
Q9UHD2
Residue:
729
  
Inhibitor
Name:
BDBM205202
Synonyms:
US9249114, A28
Type:
Small organic molecule
Emp. Form.:
C22H22N4O4S
Mol. Mass.:
438.499
SMILES:
NC(=O)c1nc(sc1NC(=O)c1ccc(CCCCCC(O)=O)cc1)-c1ccncc1
: