Target
Serine/threonine-protein kinase TBK1
Ligand
BDBM205213
Substrate
Meas. Tech.
TBK1 Enzyme Assay
pH
7.5±n/a
Temperature
303.15±n/a K
IC50
1200±n/a nM
Comments
extracted
Citation
 Karra, SRStaehle, WStaub, EWucherer-Plietker, M Thiazole derivatives US Patent  US9249114 Publication Date 2/2/2016 
Target
Name:
Serine/threonine-protein kinase TBK1
Synonyms:
NAK Protein cereblon/Serine/threonine-protein kinase TBK1 TANK-binding kinase 1 (TBK-1) TBK1 | TBK1_HUMAN
Type:
protein
Mol. Mass.:
83645.20
Organism:
Homo sapiens (Human)
Description:
Q9UHD2
Residue:
729
  
Inhibitor
Name:
BDBM205213
Synonyms:
US9249114, A39
Type:
Small organic molecule
Emp. Form.:
C24H27N7O4S
Mol. Mass.:
509.581
SMILES:
CC(C)(C)OC(=O)N1CCN(CC1)c1ccc(cn1)C(=O)Nc1sc(nc1C(N)=O)-c1ccncc1
: