Target
Inhibitor of nuclear factor kappa-B kinase subunit epsilon
Ligand
BDBM205195
Substrate
Meas. Tech.
IKKε Kinase Assay
pH
7.5±n/a
Temperature
303.15±n/a K
IC50
14±n/a nM
Comments
extracted
Citation
 Karra, SRStaehle, WStaub, EWucherer-Plietker, M Thiazole derivatives US Patent  US9249114 Publication Date 2/2/2016 
Target
Name:
Inhibitor of nuclear factor kappa-B kinase subunit epsilon
Synonyms:
I kappa-B kinase epsilon I-kappa-B kinase epsilon (IKK-E) IKBKE IKK-epsilon IKKE IKKI KIAA0151 | von Hippel-Lindau disease tumor suppressor/Inhibitor of nuclear factor kappa-B kinase subunit epsilon
Type:
Serine/threonine-protein kinase
Mol. Mass.:
80475.98
Organism:
Homo sapiens (Human)
Description:
Kinase inhibitory activity was determined using recombinant human IKK-epsilon expressed in baculovirus as a FLAG-tagged fusion protein.
Residue:
716
  
Inhibitor
Name:
BDBM205195
Synonyms:
US9249114, A21
Type:
Small organic molecule
Emp. Form.:
C23H26N6O3S
Mol. Mass.:
466.556
SMILES:
COc1cnccc1-c1nc(C(N)=O)c(NC(=O)c2ccc(CN3CCN(C)CC3)cc2)s1
: