Target
Inhibitor of nuclear factor kappa-B kinase subunit epsilon
Ligand
BDBM205235
Substrate
Meas. Tech.
IKKε Kinase Assay
pH
7.5±n/a
Temperature
303.15±n/a K
IC50
140±n/a nM
Comments
extracted
Citation
 Karra, SRStaehle, WStaub, EWucherer-Plietker, M Thiazole derivatives US Patent  US9249114 Publication Date 2/2/2016 
Target
Name:
Inhibitor of nuclear factor kappa-B kinase subunit epsilon
Synonyms:
I kappa-B kinase epsilon I-kappa-B kinase epsilon (IKK-E) IKBKE IKK-epsilon IKKE IKKI KIAA0151 | von Hippel-Lindau disease tumor suppressor/Inhibitor of nuclear factor kappa-B kinase subunit epsilon
Type:
Serine/threonine-protein kinase
Mol. Mass.:
80475.98
Organism:
Homo sapiens (Human)
Description:
Kinase inhibitory activity was determined using recombinant human IKK-epsilon expressed in baculovirus as a FLAG-tagged fusion protein.
Residue:
716
  
Inhibitor
Name:
BDBM205235
Synonyms:
US9249114, A61
Type:
Small organic molecule
Emp. Form.:
C14H11N5O2S
Mol. Mass.:
313.334
SMILES:
NC(=O)c1nc(sc1NC(=O)c1ccc[nH]1)-c1ccncc1
: