Target
Coagulation factor XI
Ligand
BDBM289803
Substrate
Meas. Tech.
Factor XIa Assay
pH
7.4±n/a
Temperature
298.15±n/a K
Ki
15.6±n/a nM
Comments
extracted
Citation
 Lim, YGuo, ZAli, AEdmondson, SDLiu, WGallo-Etienne, GVWu, HGao, YStamford, AWYu, YKevin, NJAnand, RSha, DNeelamkavil, SFHussain, ZKumar, PMoningka, RDuffy, JLXu, JJiang, YChakrabarti, ASone, H Factor XIa inhibitors US Patent  US10093683 Publication Date 10/9/2018 
Target
Name:
Coagulation factor XI
Synonyms:
Coagulation factor XIa Coagulation factor XIa light chain FA11_HUMAN Factor XIa PTA | Plasma thromboplastin antecedent
Type:
Enzyme
Mol. Mass.:
70130.58
Organism:
Homo sapiens (Human)
Description:
P03951
Residue:
625
  
Inhibitor
Name:
BDBM289803
Synonyms:
N—((S)-1-((R)-6-chloro-5-fluoro-2-oxo-1,2-dihydrospiro[benzo[d][1,3]oxazine-4,3′-piperidin]-1′-yl)-1-oxo-3-(pyrimidin-5-yl)propan-2-yl)-2-oxo-1,2-dihydroquinoline-6-carboxamide | US10093683, Example 113
Type:
Small organic molecule
Emp. Form.:
C29H24ClFN6O5
Mol. Mass.:
590.989
SMILES:
Fc1c(Cl)ccc2NC(=O)O[C@]3(CCCN(C3)C(=O)C(Cc3cncnc3)NC(=O)c3ccc4[nH]c(=O)ccc4c3)c12
: