Target
Catechol O-methyltransferase
Ligand
BDBM206349
Substrate
Meas. Tech.
Fluorescence Polarization Assay
Temperature
298.15±n/a K
IC50
590±n/a nM
Comments
extracted
Citation
 Wolkenberg, SHarrison, STBarrow, JCZhao, ZMelamed, JKett, NRZartman, A Inhibitors of catechol O-methyl transferase and their use in the treatment of psychotic disorders US Patent  US9260413 Publication Date 2/16/2016 
Target
Name:
Catechol O-methyltransferase
Synonyms:
COMT Catechol O-methyltransferase | Catechol O-methyltransferase (MB-COMT)
Type:
Enzyme
Mol. Mass.:
30030.67
Organism:
Homo sapiens (Human)
Description:
P21964
Residue:
271
  
Inhibitor
Name:
BDBM206349
Synonyms:
US9260413, Example 8
Type:
Small organic molecule
Emp. Form.:
C18H12N2O2
Mol. Mass.:
288.3001
SMILES:
Oc1cnc([nH]c1=O)-c1cccc(c1)C#Cc1ccccc1
: