Target
Isoform 2 of Protein mono-ADP-ribosyltransferase PARP3 (Long)
Ligand
BDBM207617
Substrate
Meas. Tech.
PARP-2 and PARP-3 Enzymatic Assay
IC50
18±n/a nM
Citation
 Zhou, CRen, BWang, H Fused tetra or penta-cyclic dihydrodiazepinocarbazolones as PARP inhibitors US Patent  US9260440 Publication Date 2/16/2016 
Target
Name:
Isoform 2 of Protein mono-ADP-ribosyltransferase PARP3 (Long)
Synonyms:
ADPRT3 PARP3 Poly [ADP-ribose] polymerase 3 (PARP-3) | Protein mono-ADP-ribosyltransferase PARP3 (Long)
Type:
Protein
Mol. Mass.:
60847.85
Organism:
Homo sapiens (Human)
Description:
Q9Y6F1-2
Residue:
540
  
Inhibitor
Name:
BDBM207617
Synonyms:
US9260440, 62 | US9617273, Example 62
Type:
Small organic molecule
Emp. Form.:
C16H17N5O2
Mol. Mass.:
311.3385
SMILES:
CC(C)(N)C(=O)N1Cc2[nH]c3cccc4c3c2c(C1)n[nH]c4=O
: