Target
C-X-C chemokine receptor type 3/Guanine nucleotide-binding protein subunit alpha-15
Ligand
BDBM208708
Substrate
Meas. Tech.
FLIPR Assay
pH
7.4±n/a
Temperature
310.15±n/a K
IC50
0.1±n/a nM
Comments
extracted
Citation
 Caroff, EKeller, MKimmerlin, TMeyer, E 4-(benzoimidazol-2-yl)-thiazole compounds and related aza derivatives US Patent  US9266876 Publication Date 2/23/2016 
Target
Name:
C-X-C chemokine receptor type 3/Guanine nucleotide-binding protein subunit alpha-15
Synonyms:
CXCR3A / G protein (Galpha(16))
Type:
Protein
Mol. Mass.:
Description:
Components:
This complex has 2 components.
Component 1
Name:
C-X-C chemokine receptor type 3
Synonyms:
AAO92295.1 C-X-C chemokine receptor type 3 (CXCR3) CXCR3 CXCR3_HUMAN chemokine (C-X-C motif) receptor 3
Type:
Enzyme Catalytic Domain
Mol. Mass.:
40665.65
Organism:
Homo sapiens (Human)
Description:
Residue:
368
  
Component 2
Name:
Guanine nucleotide-binding protein subunit alpha-15
Synonyms:
G protein alpha 16 G-protein subunit alpha-16 (G alpha-16) GNA15_HUMAN Guanine nucleotide-binding protein subunit alpha-15 [Y147C]
Type:
Protein
Mol. Mass.:
43577.62
Organism:
Homo sapiens (Human)
Description:
P30679
Residue:
374
  
Inhibitor
Name:
BDBM208708
Synonyms:
US9266876, 175
Type:
Small organic molecule
Emp. Form.:
C21H19ClF3N7OS
Mol. Mass.:
509.935
SMILES:
C[C@@H]1CN(CCN1C(=O)Cn1cc(Cl)cn1)c1sc(nc1-c1nc2ccccc2[nH]1)C(F)(F)F
: