Target
Heat shock protein HSP 90-alpha
Ligand
BDBM210942
Substrate
Meas. Tech.
Fluorescence Polarization (FP) Assay
pH
7.3±n/a
Kd
>1.00e+5±n/a nM
Comments
extracted
Citation
 Mishra, SJGhosh, SStothert, ARDickey, CABlagg, BS Transformation of the Non-Selective Aminocyclohexanol-Based Hsp90 Inhibitor into a Grp94-Seletive Scaffold. ACS Chem Biol 12:244-253 (2017)  
Target
Name:
Heat shock protein HSP 90-alpha
Synonyms:
HS90A_HUMAN HSP86 HSP90AA1 HSPCA Heat shock 86 kDa Heat shock protein HSP 90-alpha (HSP90) LAP-2 Lipopolysaccharide-associated protein 2 heat shock protein 90kDa alpha (cytosolic), class A member 1 isoform 2
Type:
Molecular Chaperone
Mol. Mass.:
84623.45
Organism:
Homo sapiens (Human)
Description:
P07900
Residue:
732
  
Inhibitor
Name:
BDBM210942
Synonyms:
2-(((1r,4r)-4-hydroxycyclohexyl)amino)-4-(2-(p-tolyl)-1H-pyrrol-1-yl)benzamide (5d) | US10975030, Compound 5d
Type:
Small organic molecule
Emp. Form.:
C24H27N3O2
Mol. Mass.:
389.4901
SMILES:
Cc1ccc(cc1)-c1cccn1-c1ccc(C(N)=O)c(NC2CCC(O)CC2)c1
: