Target
Cytochrome P450 2C9
Ligand
BDBM211836
Substrate
Meas. Tech.
Cytochrome P450 2C9 Inhibition Assay (Diclofenac)
Temperature
310.15±n/a K
IC50
>50000±n/a nM
Comments
extracted
Citation
 Gnamm, COost, TPeters, SHoesch, HRies, UJ Substituted bicyclic dihydropyrimidinones and their use as inhibitors of neutrophil elastase activity US Patent  US9290459 Publication Date 3/22/2016 
Target
Name:
Cytochrome P450 2C9
Synonyms:
(R)-limonene 6-monooxygenase CP2C9_HUMAN CYP2C9 Cytochrome P450 2C9 (CYP2C9 ) P-450MP P450 PB-1 | S-mephenytoin 4-hydroxylase
Type:
Enzyme
Mol. Mass.:
55636.33
Organism:
Homo sapiens (Human)
Description:
P11712
Residue:
490
  
Inhibitor
Name:
BDBM211836
Synonyms:
US9290459, 41A | US9670166, 41A
Type:
Small organic molecule
Emp. Form.:
C26H23F3N4O4
Mol. Mass.:
512.4804
SMILES:
CC(C)(O)CNC(=O)N1[C@@H](C2=C(CCC2=O)N(C1=O)c1cccc(c1)C(F)(F)F)c1ccc(cc1)C#N
: