Target
Plasma kallikrein
Ligand
BDBM212051
Substrate
Meas. Tech.
In-vitro Plasma Kallikrein Inhibition
pH
7.8±n/a
Temperature
298.15±n/a K
IC50
18±n/a nM
Comments
extracted
Citation
 Brandl, TFlohr, SKopec, SLachal, JMarkert, CNamoto, KNganga, PPirard, BRenatus, MSedrani, RZoller, T N-((6-amino-pyridin-3-yl)methyl)-heteroaryl-carboxamides US Patent  US9290485 Publication Date 3/22/2016 
Target
Name:
Plasma kallikrein
Synonyms:
Fletcher factor KLKB1 Kallikrein Plasma kallikrein heavy chain Plasma prekallikrein
Type:
Protein
Mol. Mass.:
71391.16
Organism:
Homo sapiens (Human)
Description:
P03952
Residue:
638
  
Inhibitor
Name:
BDBM212051
Synonyms:
US9290485, 83
Type:
Small organic molecule
Emp. Form.:
C23H23N5O
Mol. Mass.:
385.4616
SMILES:
Cc1cc(N)nc(C)c1CNC(=O)c1cnn(Cc2ccc3ccccc3c2)c1
: