Target
Plasma kallikrein
Ligand
BDBM212099
Substrate
Meas. Tech.
In-vitro Plasma Kallikrein Inhibition
pH
7.8±n/a
Temperature
298.15±n/a K
IC50
9±n/a nM
Comments
extracted
Citation
 Brandl, TFlohr, SKopec, SLachal, JMarkert, CNamoto, KNganga, PPirard, BRenatus, MSedrani, RZoller, T N-((6-amino-pyridin-3-yl)methyl)-heteroaryl-carboxamides US Patent  US9290485 Publication Date 3/22/2016 
Target
Name:
Plasma kallikrein
Synonyms:
Fletcher factor KLKB1 Kallikrein Plasma kallikrein heavy chain Plasma prekallikrein
Type:
Protein
Mol. Mass.:
71391.16
Organism:
Homo sapiens (Human)
Description:
P03952
Residue:
638
  
Inhibitor
Name:
BDBM212099
Synonyms:
US9290485, 131
Type:
Small organic molecule
Emp. Form.:
C22H23N5O3S
Mol. Mass.:
437.515
SMILES:
Cc1cc(N)nc(C)c1CNC(=O)c1ccn(c1)S(=O)(=O)c1ccc2n(C)ccc2c1
: