Target
Plasma kallikrein
Ligand
BDBM212115
Substrate
Meas. Tech.
In-vitro Plasma Kallikrein Inhibition
pH
7.8±n/a
Temperature
298.15±n/a K
IC50
0.1±n/a nM
Comments
extracted
Citation
 Brandl, TFlohr, SKopec, SLachal, JMarkert, CNamoto, KNganga, PPirard, BRenatus, MSedrani, RZoller, T N-((6-amino-pyridin-3-yl)methyl)-heteroaryl-carboxamides US Patent  US9290485 Publication Date 3/22/2016 
Target
Name:
Plasma kallikrein
Synonyms:
Fletcher factor KLKB1 Kallikrein Plasma kallikrein heavy chain Plasma prekallikrein
Type:
Protein
Mol. Mass.:
71391.16
Organism:
Homo sapiens (Human)
Description:
P03952
Residue:
638
  
Inhibitor
Name:
BDBM212115
Synonyms:
US9290485, 147
Type:
Small organic molecule
Emp. Form.:
C23H26N8O
Mol. Mass.:
430.5055
SMILES:
Cc1ccnn1Cc1ccc(Cn2cc(nn2)C(=O)NCc2c(C)cc(N)nc2C)cc1
: