Target
Cytochrome P450 11B2, mitochondrial
Ligand
BDBM212442
Substrate
Meas. Tech.
Inhbition Assay
Temperature
310.15±n/a K
IC50
7.3±n/a nM
Comments
extracted
Citation
 Ali, ABey, EHartmann, RHu, QYin, L Aldosterone synthase inhibitors US Patent  US9278093 Publication Date 3/8/2016 
Target
Name:
Cytochrome P450 11B2, mitochondrial
Synonyms:
Aldosterone Synthase (CYP11B2) Aldosterone-synthesizing enzyme CYP11B2 Cytochrome P450 11B2 Cytochrome P450 11B2, mitochondrial P-450C18 | Steroid 18-hydroxylase
Type:
Protein
Mol. Mass.:
57582.15
Organism:
Homo sapiens (Human)
Description:
P19099
Residue:
503
  
Inhibitor
Name:
BDBM212442
Synonyms:
US9278093, 1
Type:
Small organic molecule
Emp. Form.:
C19H16F2N4
Mol. Mass.:
338.3539
SMILES:
Cc1nnc2CCc3cc(cc(F)c3-n12)-c1cncc(F)c1C1CC1
: