Target
Cytochrome P450 11B1, mitochondrial
Ligand
BDBM212442
Substrate
Meas. Tech.
Inhbition Assay
Temperature
310.15±n/a K
IC50
2293±n/a nM
Comments
extracted
Citation
 Ali, ABey, EHartmann, RHu, QYin, L Aldosterone synthase inhibitors US Patent  US9278093 Publication Date 3/8/2016 
Target
Name:
Cytochrome P450 11B1, mitochondrial
Synonyms:
C11B1_HUMAN CYPXIB1 Cytochrome P450 11B1 Cytochrome P450 11B1, mitochondrial | S11BH
Type:
Enzyme
Mol. Mass.:
57591.44
Organism:
Homo sapiens (Human)
Description:
P15538
Residue:
503
  
Inhibitor
Name:
BDBM212442
Synonyms:
US9278093, 1
Type:
Small organic molecule
Emp. Form.:
C19H16F2N4
Mol. Mass.:
338.3539
SMILES:
Cc1nnc2CCc3cc(cc(F)c3-n12)-c1cncc(F)c1C1CC1
: