Target
Baculoviral IAP repeat-containing protein 2 [256-363]
Ligand
BDBM213379
Substrate
Meas. Tech.
XIAP BIR3 & cIAP1 BIR3 Binding Assays (DELFIA)
Temperature
298.15±n/a K
IC50
1±n/a nM
Comments
extracted
Citation
 Reiser, UMadden, J 6-Alkynyl Pyridine US Patent  US9278978 Publication Date 3/8/2016 
Target
Name:
Baculoviral IAP repeat-containing protein 2 [256-363]
Synonyms:
API1 BIRC2_HUMAN Cellular inhibitor of apoptosis 1 BIR3 domain (c-IAP1 BIR3) MIHB | RNF48
Type:
Enzyme
Mol. Mass.:
12600.71
Organism:
Homo sapiens (Human)
Description:
Human cIAP BIR3 domain (256-363 aa)
Residue:
108
  
Inhibitor
Name:
BDBM213379
Synonyms:
US9278978, 14
Type:
Small organic molecule
Emp. Form.:
C31H31N7O2
Mol. Mass.:
533.6235
SMILES:
CN[C@H](C)C(=O)Nc1cc(cc(n1)C#Cc1ccc2c(C)nccc2c1)-c1c(C)nc(C)c2c1n(C)n(C)c2=O
: